{"text_format":"1","workbook":"xlsx","n_sheets":20,"sheets":["Eingabeblatt","Deckblatt","Daten","Schallschutzausweis ausführlich","Schallschutzausweis einfach","Hinweise","LS Decken","TS Decken","TS Treppen, Podeste, Hausflure","TS Balkone, Loggien, Terrassen","LS Eingangstüren","LS Außenbauteile","Wasserinst., haustech. Anlagen","Nutzergeräusche, KHW","Baulicher Schallschutz (GR)","eigener Wohnbereich","Gebietscharakter","Außenlärmpegel","LS Wände","Baulicher Schallschutz (NHZ)"],"not_rendered":{"charts":0,"images":2,"macros":1,"external_links":0,"defined_names":5,"comments":0,"pivot_tables":0},"unopened":[],"bounds":{"document_bytes":16777216,"sheet_cells":100000,"rows_first":2000,"rows_last":500,"rows_between":2000,"halvings":0,"cell_chars":16384,"cell_head_chars":4096},"cells_cut":0,"cells_raw":0,"read":"whole","date_system":"1900"}

{"sheet":"Eingabeblatt","index":0,"n_rows":105,"n_cols":26,"rows_kept":105,"cut":false,"hidden":false,"merged":[[44,6,44,11],[86,6,86,7],[97,6,97,11],[9,2,9,6],[8,4,8,6],[24,5,24,13],[3,1,3,12],[80,6,80,11],[33,5,33,13],[32,5,32,13],[39,1,39,11],[34,5,34,13],[42,6,42,11],[41,1,41,11],[22,7,22,13],[75,1,75,11],[34,1,34,4],[56,1,56,11],[47,1,47,11],[40,6,40,11],[23,7,23,13],[31,8,31,13],[99,6,99,11],[77,6,77,7],[81,1,81,11],[85,1,85,11],[95,6,95,11],[92,1,92,11],[93,6,93,11],[90,1,90,11],[98,1,98,11],[79,1,79,11],[94,1,94,11],[96,1,96,11],[108,5,108,6],[7,4,7,6],[5,4,5,6],[6,4,6,6],[30,5,30,13],[20,5,20,13],[12,5,12,13],[13,5,13,13],[14,5,14,13],[19,5,19,13],[15,7,15,13],[21,5,21,13],[25,5,25,13],[91,6,91,11],[23,5,23,6],[76,6,76,11]]}
[]
[null,"Schallschutzausweis Eingabeblatt"]
[]
[]
[null,"Aussteller: "]
[null,null,"Name:",null,null,null,null,null,null,"Datum:"]
[null,null,"Zusatz:"]
[null,null,"Straße, Nr.:",null,null,null,null,null,null,"Gültig bis:",{"$f":"IF(K6=\"\",\"\",DATE(YEAR(K6)+10,MONTH(K6),DAY(K6)))","v":""}]
[null,null,"PLZ, Ort:"]
[]
[]
[]
[null,"Antragsteller:"]
[]
[]
[null,null,null,null,null,null,"Ort "]
[]
[]
[]
[null,"Gebäude"]
{"$rows_left_out":86}
{"sheet":"Deckblatt","index":1,"n_rows":48,"n_cols":6,"rows_kept":48,"cut":false,"hidden":true,"merged":[[1,1,1,4],[3,3,3,5],[13,3,13,5],[27,3,27,4],[21,3,21,4],[22,3,22,4],[23,3,23,4],[24,3,24,4],[25,3,25,4],[26,3,26,4]]}
[]
[null,"Schallschutzausweis"]
[]
[]
[]
[null,"Gebäudetyp",null,null,{"$f":"Eingabeblatt!$F$24","v":0}]
[null,"Baujahr des Gebäudes",null,null,{"$f":"Eingabeblatt!$F$25","v":0}]
[null,"Anzahl der Wohneinheiten",null,null,{"$f":"Eingabeblatt!$F$26","v":0}]
[null,"Bezeichnung der Wohneinheit",null,null,{"$f":"Eingabeblatt!$F$31","v":0}]
[null,"Geschoss",null,null,{"$f":"IF(OR(Eingabeblatt!$F$32=\"Obergeschoss\",Eingabeblatt!$F$32=\"Untergeschoss\"),Eingabeblatt!$H$32 & \". \" & Eingabeblatt!$F$32 & \" \" & Eingabeblatt!$I$32,IF(Eingabeblatt!$F$32=\"Sonstiges\",Eingabeblatt!$I$32,IF(OR(Eingabeblatt!$F$32=\"Erdgeschoss\",Eingabeblatt!$F$32=\"Dachgeschoss\"),Eingabeblatt!$F$32 & \" \" & Eingabeblatt!$I$32,\"\")))","v":""}]
[null,"Anzahl der Räume",null,null,{"$f":"Eingabeblatt!$F$33","v":0}]
[null,"Wohnfläche [m²]",null,null,{"$f":"Eingabeblatt!$F$34","v":0}]
[]
[]
[]
[null,"Klasse",null,"Beschreibung","Bemerkung"]
[]
[]
[]
[null,null,null,"Standort und Außenlärmsituation"]
{"$rows_left_out":29}
{"sheet":"Daten","index":2,"n_rows":149,"n_cols":3,"rows_kept":149,"cut":false,"hidden":true,"merged":[]}
[]
["reines Wohngebiet","A*"]
["allgemeines Wohngebiet","A"]
["Mischgebiet / besonderes Wohngebiet","C"]
["Gewerbegebiet","E"]
["Industriegebiet","F"]
[]
[]
["bis 55","A*"]
["56 - 60","B"]
["61 - 65","C"]
["66 - 70","D"]
["71 - 75","E"]
["≥ 76","F"]
[]
[]
["ja"]
["nein"]
[]
[]
{"$rows_left_out":130}
{"sheet":"Schallschutzausweis ausführlich","index":3,"n_rows":71,"n_cols":38,"rows_kept":71,"cut":false,"hidden":true,"merged":[[45,1,51,1],[5,20,6,22],[14,17,14,18],[5,4,5,8],[6,4,6,8],[7,4,7,8],[5,12,5,18],[6,12,6,18],[14,3,14,11],[7,20,7,22],[8,20,8,22],[7,12,7,18],[8,4,8,8],[8,12,8,18],[16,15,17,15],[16,17,21,18],[19,20,19,22],[29,20,29,22],[26,20,26,22],[27,20,27,22],[20,20,20,22],[23,20,23,22],[21,13,21,15],[35,20,35,22],[36,20,36,22],[32,20,32,22],[33,20,33,22],[31,20,31,22],[34,20,34,22],[39,33,40,33],[41,33,42,33],[37,20,37,22],[38,20,38,22],[39,20,39,22],[40,20,40,22],[64,20,65,22],[66,20,66,22],[59,20,59,22],[63,20,63,22],[60,20,62,22],[57,3,57,22],[60,3,60,8],[61,3,61,8],[62,3,64,8],[64,17,66,18],[63,17,63,18],[59,13,59,15],[59,10,59,11],[60,13,62,15],[64,13,66,15],[63,10,63,11],[60,10,62,11],[64,10,66,11],[60,17,62,18],[59,17,59,18],[59,3,59,8],[63,13,63,14],[54,20,54,22],[51,33,53,33],[54,33,55,33],[45,5,45,8],[46,26,51,26],[55,13,55,15],[55,3,55,11],[55,20,55,22],[50,20,51,22],[45,9,45,11],[53,20,53,22],[45,20,45,22],[46,20,47,22],[48,20,49,22],[50,15,51,15],[50,13,51,13],[52,3,52,4],[52,20,52,22],[49,5,49,8],[50,9,51,11],[54,3,54,4],[50,5,50,8],[51,5,51,8],[53,9,53,10],[43,33,44,33],[45,33,46,33],[42,20,42,22],[44,20,44,22],[41,20,41,22],[43,20,43,22],[43,9,43,11],[46,15,47,15],[41,9,41,11],[42,9,42,11],[44,9,44,11],[26,3,26,4],[23,17,55,18],[32,3,32,4],[46,5,46,8],[40,8,40,11],[38,9,38,11],[29,9,29,10],[30,9,30,10],[31,9,31,10],[33,9,33,11],[39,9,39,11],[47,5,47,8],[48,5,48,8],[44,6,44,7],[43,5,43,8],[48,9,49,11],[46,9,47,11],[48,15,49,15],[48,13,49,13],[33,7,33,8],[25,9,25,10],[46,13,47,13],[45,3,51,4],[44,3,44,4],[28,20,28,22],[19,9,19,11],[20,9,20,11],[20,5,20,8],[19,5,19,8],[21,20,21,22],[34,7,34,8],[32,7,32,8],[25,7,25,8],[27,7,27,8],[26,7,26,8],[26,9,26,10],[27,9,27,10],[28,9,28,10],[1,1,1,22],[10,3,10,22],[3,3,3,22],[20,3,20,4],[14,20,14,22],[21,3,21,11],[43,3,43,4],[39,3,39,4],[36,7,36,8],[37,7,37,8],[35,7,35,11],[37,3,37,4],[37,9,37,11],[38,7,38,8],[39,7,39,8],[18,3,18,4],[18,5,18,11],[16,20,16,22],[18,20,18,22],[27,3,27,4],[42,3,42,4],[41,3,41,4],[30,20,30,22],[25,20,25,22],[54,9,54,10],[36,9,36,11],[34,9,34,11],[32,9,32,11],[29,3,29,4],[31,3,31,4],[30,3,30,4],[33,3,33,4],[34,3,34,4],[52,5,52,11],[35,5,36,6],[37,5,37,6],[53,5,53,6],[54,5,54,6]]}
[]
[null,"Detaillierter Schallschutzausweis"]
[]
[]
[]
[null,"Antragsteller:",null,null,{"$f":"Eingabeblatt!$F$13","v":0},null,null,null,null,null,"Gebäude:",null,{"$f":"Eingabeblatt!$F$20","v":0},null,null,null,null,null,null,null,"Bezeichnung der Wohneinheit"]
[null,null,null,null,{"$f":"Eingabeblatt!$F$14","v":0},null,null,null,null,null,null,null,{"$f":"Eingabeblatt!$F$21","v":0}]
[null,null,null,null,{"$f":"Eingabeblatt!$F$15","v":0},null,null,null,null,null,null,null,{"$f":"Eingabeblatt!$F$22","v":0},null,null,null,null,null,null,null,{"$f":"Eingabeblatt!$F$31","v":0}]
[null,null,null,null,{"$f":"Eingabeblatt!$F$16 & \" \" & Eingabeblatt!$H$16","v":" "},null,null,null,null,null,null,null,{"$f":"Eingabeblatt!$F$23 & \" \" & Eingabeblatt!$H$23","v":" "}]
[]
[]
[]
[]
[]
[null,"Nr.",null,"Kriterien",null,null,null,null,null,null,null,null,null,"Punkte",null,"Skala",null,"Beurteilung",null,null,"Bemerkungen"]
[]
[null,null,null,"Standort und Außenlärmsituation",null,null,null,null,null,null,null,null,null,null,null,null,null,{"$f":"IF(OR(P19=\"\",P21=\"\"),\"\",IF(N22<10,\"F\",IF(N22<20,\"E\",IF(N22<25,IF(OR(P19=\"F\",P21=\"F\"),\"E\",\"D\"),IF(N22<40,IF(OR(P19=\"F\",P21=\"F\"),\"E\",IF(OR(P19=\"E\",P21=\"E\"),\"D\",\"C\")),IF(N22<45,IF(OR(P19=\"F\",P21=\"F\"),\"E\",IF(OR(P19=\"E\",P21=\"E\"),\"D\",IF(OR(P19=\"D\",P21=\"D\"),\"C\",\"B\"))),IF(N22<55,IF(OR(P19=\"F\",P21=\"F\"),\"E\",IF(OR(P19=\"E\",P21=\"E\"),\"D\",IF(OR(P19=\"D\",P21=\"D\"),\"C\",IF(OR(P19=\"C\",P21=\"C\"),\"B\",\"A\")))),IF(OR(P19=\"F\",P21=\"F\"),\"E\",IF(OR(P19=\"E\",P21=\"E\"),\"D\",IF(OR(P19=\"D\",P21=\"D\"),\"C\",IF(OR(P19=\"C\",P21=\"C\"),\"B\",IF(OR(P19=\"B\",P21=\"B\"),\"A\",\"A*\"))))))))))))","v":""}]
[]
[null,"1 - 5",null,"Gebietscharakter:",null,{"$f":"IF(Eingabeblatt!G41=\"\",\"\",Eingabeblatt!G41)","v":""},null,null,null,null,null,null,null,{"$f":"IF(F19=\"allgemeines Wohngebiet\",20,IF(F19=\"reines Wohngebiet\",30,(IF(F19=\"Mischgebiet / besonderes Wohngebiet\",10,IF(F19=\"Gewerbegebiet\",5,0)))))","v":0},null,{"$f":"IF($F19=\"\",\"\",VLOOKUP($F19,Daten!$A$2:$B$7,2,FALSE))","v":""}]
[null,null,null,null,null,"maßgeblicher\nAußenlärmpegel in dB(A)",null,null,null,"Freibereich\nabgewandt"]
{"$rows_left_out":52}
{"sheet":"Schallschutzausweis einfach","index":4,"n_rows":75,"n_cols":26,"rows_kept":75,"cut":false,"hidden":true,"merged":[[1,1,1,24],[3,3,3,24],[5,4,5,9],[5,13,5,19],[5,21,6,24],[6,4,6,9],[6,13,6,19],[7,4,7,9],[7,13,7,19],[7,21,7,24],[8,13,8,19],[8,5,8,9],[10,3,10,24],[12,1,14,24],[15,1,16,5],[15,23,16,24],[17,1,22,5],[17,6,24,22],[17,23,24,24],[23,1,24,5],[26,3,26,24],[28,1,30,24],[31,1,34,5],[31,6,32,20],[31,23,34,24],[33,6,34,19],[35,1,38,5],[35,19,35,21],[35,23,41,24],[38,7,38,22],[39,1,39,5],[40,1,41,5],[61,1,61,16],[61,18,61,24],[53,3,53,24],[55,1,55,16],[55,18,55,24],[56,1,56,16],[56,18,56,24],[57,1,57,16],[57,18,57,24],[43,1,47,5],[58,1,58,16],[59,1,59,16],[60,1,60,16],[60,18,60,24],[43,14,45,16],[43,18,45,21],[49,1,51,5],[49,6,49,24],[50,6,51,24],[65,4,65,9],[66,4,66,9],[67,4,67,9],[69,12,69,16],[70,12,70,16]]}
[]
[null,"Schallschutzausweis"]
[]
[]
[]
[null,"Antragsteller:",null,null,{"$f":"'Schallschutzausweis ausführlich'!E6:I6","v":0},null,null,null,null,null,null,"Gebäude:",null,{"$f":"'Schallschutzausweis ausführlich'!M6","v":0},null,null,null,null,null,null,null,"Bezeichung der Wohneinheit"]
[null,null,null,null,{"$f":"'Schallschutzausweis ausführlich'!E7:I7","v":0},null,null,null,null,null,null,null,null,{"$f":"'Schallschutzausweis ausführlich'!M7","v":0}]
[null,null,null,null,{"$f":"'Schallschutzausweis ausführlich'!E8:I8","v":0},null,null,null,null,null,null,null,null,{"$f":"'Schallschutzausweis ausführlich'!M8","v":0},null,null,null,null,null,null,null,{"$f":"'Schallschutzausweis ausführlich'!U8","v":0}]
[null,null,null,null,{"$f":"Eingabeblatt!$F$16","v":0},{"$f":"Eingabeblatt!H16","v":0},null,null,null,null,null,null,null,{"$f":"'Schallschutzausweis ausführlich'!M9","v":" "}]
[]
[]
[]
[null,"Standort und Außenlärmsituation"]
[]
[]
[null,"Punktzahl",null,null,null,null,null,null,null,null,null,null,null,null,null,null,null,null,null,null,null,null,null,"Klasse"]
[]
[null,{"$f":"'Schallschutzausweis ausführlich'!$N$61","v":""},null,null,null,null,{"$f":"IF(B18=\"\",\"Es sind keine Angaben zu Standort und Außenlärmsituation vorhanden.\",IF($X18=\"\",\"\",VLOOKUP($X18,Daten!A134:B140,2,FALSE)))","v":"Es sind keine Angaben zu Standort und Außenlärmsituation vorhanden."},null,null,null,null,null,null,null,null,null,null,null,null,null,null,null,null,{"$f":"'Schallschutzausweis ausführlich'!R17","v":""}]
[]
[]
{"$rows_left_out":56}
{"sheet":"Hinweise","index":5,"n_rows":55,"n_cols":7,"rows_kept":55,"cut":false,"hidden":false,"merged":[[1,1,1,5]]}
[]
[null,"Hinweise zum Schallschutzausweis"]
[]
[]
[]
[null,"Klasse",null,"Beschreibung",null,"Bemerkung"]
[]
[]
[]
[null,null,null,"Standort und Außenlärmsituation"]
[]
[null,"Klasse A*:",null,"sehr leises Wohngebiet"]
[]
[null,"Klasse A:",null,"ruhiges Wohngebiet"]
[]
[null,"Klasse B:",null,"Wohngebiet ohne besondere Anforderungen an den Schallschutz der Außenbauteile"]
[]
[null,"Klasse C:",null,"Misch- bzw. Kerngebiet mit mäßiger Außenlärmbelastung und Anforderungen an den Schallschutz der Außenbauteile"]
[]
[null,"Klasse D:",null,"Misch- bzw. Kerngebiet mit hohen Anforderungen an den Schallschutz der Außenbauteile"]
{"$rows_left_out":36}
{"sheet":"LS Decken","index":6,"n_rows":15,"n_cols":14,"rows_kept":15,"cut":false,"hidden":true,"merged":[[14,0,14,5],[9,3,9,4],[11,3,11,4],[0,0,0,1],[0,3,0,4],[2,0,11,1],[2,3,2,4],[10,3,10,4],[9,6,10,6],[2,6,7,6],[3,3,3,4],[4,3,4,4],[5,3,5,4],[6,3,6,4],[7,3,7,4]]}
["Bereich",null,"NR","Kriterium",null,"Punkte",null,"F","E","D","C","B","A","A*"]
[]
["Decken\nR'w in dB",null,27,"> 72",null,50]
[null,null,28,"> 67",null,40]
[null,null,29,"> 62",null,30]
[null,null,30,"> 57",null,20]
[null,null,31,"> 54",null,10]
[null,null,32,"> 50",null,5]
[null,null,null,"Nachweis"]
[null,null,33,"rechnerischer Nachweis nach\nDIN 4109-1:2018-01",null,0]
[null,null,34,"mess-\ntechnischer Nachweis durch",null,8]
[null,null,35,"Anforderung bei R'w + Ctr,50-3150 erfüllt",null,4]
[]
["Anforderungen Luftschall"]
["Decken R'w in dB",null,null,null,null,null,null,"< 50 dB","> 50 dB","> 54 dB","> 57 dB","> 62 dB","> 67 dB","> 72 dB"]

{"sheet":"TS Decken","index":7,"n_rows":17,"n_cols":14,"rows_kept":17,"cut":false,"hidden":true,"merged":[[14,0,14,5],[9,3,9,4],[11,3,11,4],[0,0,0,1],[0,3,0,4],[2,0,11,1],[2,3,2,4],[10,3,10,4],[8,3,8,4],[2,6,7,6],[3,3,3,4],[4,3,4,4],[5,3,5,4],[6,3,6,4],[7,3,7,4]]}
["Bereich",null,"NR","Kriterium",null,"Punkte",null,"F","E","D","C","B","A","A*"]
[]
["Decken\nL'nw in dB",null,36,"< 30",null,50]
[null,null,37,"< 35",null,40]
[null,null,38,"< 40",null,30]
[null,null,39,"< 45",null,20]
[null,null,40,"< 50",null,10]
[null,null,41,"< 60",null,5]
[null,null,null,"Nachweis"]
[null,null,42,"rechnerischer Nachweis nach\nDIN 4109-01:2018-01\nDIN EN 12354-2",null,0]
[null,null,43,"mess-\ntechnischer Nachweis durch",null,8]
[null,null,44,"Anforderung bei \nL'nw + CI,50-2500 erfüllt\noder fr,Estrich < 50 Hz",null,8]
[]
["Anforderungen Trittschall"]
["Decken L'nw in dB",null,null,null,null,null,null,"> 60 dB a)","< 60 dBa)","< 50 dB","< 45 dBa)","< 40 dBa)","< 35 dB","< 30 dB"]
[]
[" a)","austauschbarer Bodenbelag anrechenbar (rechnerisch nur bei geprüftem DLw)"]

{"sheet":"TS Treppen, Podeste, Hausflure","index":8,"n_rows":17,"n_cols":14,"rows_kept":17,"cut":false,"hidden":true,"merged":[[14,0,14,5],[9,3,9,4],[11,3,11,4],[0,0,0,1],[0,3,0,4],[2,0,11,1],[2,3,2,4],[10,3,10,4],[8,3,8,4],[2,6,7,6],[3,3,3,4],[4,3,4,4],[5,3,5,4],[6,3,6,4],[7,3,7,4]]}
["Bereich",null,"NR","Kriterium",null,"Punkte",null,"F","E","D","C","B","A","A*"]
[]
["Treppen, Podeste, Laubengänge, Hausflure\nL'nw in dB\n\n1) bei Hausfluren",null,45,"< 33",null,50]
[null,null,46,"< 38",null,40]
[null,null,47,"< 43",null,30]
[null,null,48,"< 48",null,20]
[null,null,49,"≤ 53    (≤ 50) 1)",null,10]
[null,null,50,"< 63",null,5]
[null,null,null,"Nachweis"]
[null,null,51,"rechnerischer Nachweis nach\nDIN 4109-1:2018-01",null,0]
[null,null,52,"mess-\ntechnischer Nachweis",null,8]
[null,null,53,"Anforderung bei L'nw + CI,50-2500 erfüllt",null,4]
[]
["Anforderungen Trittschall"]
["Treppen, Podeste, Hausflure L'nw in dB",null,null,null,null,null,null,"> 63 dB a)","< 63 dB a)","≤ 53 dB\n(≤ 50 dB) 1)","< 48 dB a)","< 43 dB a)","< 38 dB","< 33 dB"]
[]
[" a)","austauschbarer Bodenbelag anrechenbar (rechnerisch nur bei geprüftem DLw)"]

{"sheet":"TS Balkone, Loggien, Terrassen","index":9,"n_rows":17,"n_cols":14,"rows_kept":17,"cut":false,"hidden":true,"merged":[[14,0,14,5],[9,3,9,4],[11,3,11,4],[0,0,0,1],[0,3,0,4],[2,0,11,1],[2,3,2,4],[10,3,10,4],[8,3,8,4],[2,6,7,6],[3,3,3,4],[4,3,4,4],[5,3,5,4],[6,3,6,4],[7,3,7,4]]}
["Bereich",null,"NR","Kriterium",null,"Punkte",null,"F","E","D","C","B","A","A*"]
[]
["Balkone, Loggien Terrassen\nL'n,w in dB\n\n1) bei Balkonen",null,54,"≤ 33",null,25]
[null,null,55,"≤ 38",null,20]
[null,null,56,"≤ 43",null,15]
[null,null,57,"≤ 48",null,10]
[null,null,58,"≤ 53   (≤ 58) 1)",null,5]
[null,null,59,"≤ 63",null,0]
[null,null,null,"Nachweis"]
[null,null,60,"rechnerischer Nachweis nach\nDIN 4109-1:2018-01",null,0]
[null,null,61,"messtechnischer Nachweis",null,4]
[null,null,62,"Anforderung bei L'n,w + CI,50-2500 erfüllt",null,4]
[]
["Anforderungen Trittschall"]
["Balkone, Loggien, Terrassen L'n,w in dB",null,null,null,null,null,null,"> 63 dB a)","< 63 dBa)","< 53 dB\n (≤ 58) 1)","< 48 dB a)","< 43 dB a)","< 38 dB","< 33 dB"]
[]
[" a)","weichfedernder Bodenbelag anrechenbar (rechnerisch nur bei geprüftem DLw)"]

{"sheet":"LS Eingangstüren","index":10,"n_rows":20,"n_cols":14,"rows_kept":20,"cut":false,"hidden":true,"merged":[[2,6,5,6],[3,3,3,4],[4,3,4,4],[5,3,5,4],[0,0,0,1],[0,3,0,4],[2,0,8,1],[2,3,2,4],[6,3,6,4],[7,3,7,4],[7,6,8,6],[8,3,8,4],[9,0,13,1],[17,11,17,13],[12,6,13,6],[13,3,13,4],[9,3,9,4],[10,3,10,4],[11,3,11,4],[12,3,12,4]]}
["Bereich",null,"NR","Kriterium",null,"Punkte",null,"F","E","D","C","B","A","A*"]
[]
["Luftschall Wohnungseingangstüren \n(in Flure oder Dielen)\nRw in dB",null,63,"> 40",null,30]
[null,null,64,"> 37",null,20]
[null,null,65,"> 32",null,10]
[null,null,66,"> 27",null,5]
[null,null,67,"> 22",null,0]
[null,null,68,"Nachweis durch Prüfzeugnis \n(Rechenwert RwR)",null,0]
[null,null,69,"Nachweis durch Messung am Bau",null,4]
["Luftschall Wohnungseingangstüren \n(direkt in Aufenthaltsräume)\nRw in dB",null,70,"> 42",null,10]
[null,null,71,"> 37",null,5]
[null,null,72,"> 32",null,0]
[null,null,73,"Nachweis durch Prüfzeugnis \n(Rechenwert RwR)",null,0]
[null,null,74,"Nachweis durch Messung am Bau",null,4]
[]
["Anforderungen Luftschall "]
["Wohnungseingangstüren in Fluren oder Dielen",null,null,null,null,null,null,"< 22 dB","> 22 dB","> 27 dB","> 32 dB","> 37 dB","> 40 dB"]
["Wohnungseingangstüren direkt in Aufenthaltsräumen",null,null,null,null,null,null,"<32 dB","> 32 dB","> 37 dB","> 42 dB"]
[]
["Anmerkung: Die Anforderung an die Türen gilt für die Schallübertragung über die betriebsfertig eingebaute Tür ohne Nebenwege."]
{"$rows_left_out":1}
{"sheet":"LS Außenbauteile","index":11,"n_rows":8,"n_cols":14,"rows_kept":8,"cut":false,"hidden":true,"merged":[[7,8,7,12],[0,0,0,1],[0,3,0,4],[2,3,2,4],[7,0,7,5],[3,3,3,4],[4,3,4,4]]}
["Bereich",null,"NR","Kriterium",null,"Punkte",null,"F","E","D","C","B","A","A*"]
[]
["Luftschall Außenbauteile",null,75,"DIN 4109-1 mit R'w,ges + Ctr,50-3150 erfüllt",null,15]
[null,null,76,"DIN 4109-1 erfüllt",null,10]
[null,null,77,"ohne Nachweis",null,0]
[]
["Anforderungen Außenbauteile (Luftschall) gültig ab Lärmpegelbereich II nach DIN 4109. Für geringere Außenlärmpegel keine Anforderung. "]
["Luftschall [R'w,ges]",null,null,null,null,null,null,"ohne Nachweis","wie DIN 4109-1",null,null,null,null,"wie \nDIN 4109-1 mit R'w,ges + Ctr,50-3150"]

{"sheet":"Wasserinst., haustech. Anlagen","index":12,"n_rows":15,"n_cols":14,"rows_kept":15,"cut":false,"hidden":true,"merged":[[14,0,14,13],[0,0,0,1],[0,3,0,4],[2,0,9,1],[2,6,6,6],[7,3,7,4],[7,6,8,6],[8,3,8,4],[9,3,9,4],[12,0,12,5],[12,12,12,13]]}
["Bereich",null,"NR","Kriterium",null,"Punkte",null,"F","E","D","C","B","A","A*"]
[]
["Wasserinstallation und\nHaustechnische Anlagen\nLAF,max,n in dB (A)",null,78,"LAFmax,n in dB (A)","< 20",30]
[null,null,79,"LAFmax,n in dB (A)","< 24",20]
[null,null,80,"LAFmax,n in dB (A)","< 27",10]
[null,null,81,"LAFmax,n in dB (A)","< 30",5]
[null,null,82,"LAFmax,n in dB (A)","< 35",0]
[null,null,83,"Nachweis durch Prognose",null,0]
[null,null,84,"Nachweis durch Bauakustikmessung",null,4]
[null,null,85,"LC - LA < 20 dB",null,2]
[]
["Anforderungen Geräusche aus Wasserinstallationen, haustechnischen Anlagen und Nutzergeräusch Urinieren"]
["Wasserinstallation, haustechnische Anlagen und Nutzergeräusch Urinieren [LAF,max,n]",null,null,null,null,null,null,"> 35 dB(A)","≤ 35 dB(A)","≤ 30 dB(A)","≤ 27 dB(A)","≤ 24 dB(A)","≤ 20 dB(A)"]
[]
["Anmerkung: Wenn keine tieffrequenten Geräuschanteile vorliegen, werden im Schallschutzausweis Bonuspunkte vergeben. Hiervon ist auszugehen, wenn die Differenz der C- und A-bewerteten Summenpegel gemäß DIN 45 680 kleiner als 20 dB ist.\nDie Anforderungen gelten auch für Heizungs- und Lüftungsanlagen im eigenen Bereich."]

{"sheet":"Nutzergeräusche, KHW","index":13,"n_rows":16,"n_cols":14,"rows_kept":16,"cut":false,"hidden":true,"merged":[[10,0,10,13],[14,0,14,5],[15,0,15,5],[0,0,0,1],[0,3,0,4],[2,0,2,1],[3,0,9,1],[3,6,8,6],[9,3,9,4]]}
["Bereich",null,"NR","Kriterium",null,"Punkte",null,"F","E","D","C","B","A","A*"]
[]
[null,null,null,"LAF,max,n","L'Kn,w"]
["Nutzergeräusche\nLAF,max,n in dB (A)\n\noder\n\nKörperschallentkopplung KHW\nL'Kn,w",null,86,"≤ 20","≤ 38",25]
[null,null,87,"≤ 25","≤ 43",20]
[null,null,88,"≤ 30","≤ 48",15]
[null,null,89,"≤ 35","≤ 53",10]
[null,null,90,"≤ 40","≤ 58",5]
[null,null,91,"≤ 45","≤ 63",0]
[null,null,92,"Nachweis durch Bauakustikmessung",null,4]
[]
[]
[]
["Orientierungswerte Nutzergeräusche und Körperschallentkopplung"]
["Nutzergeräusche [LAF,max,n]",null,null,null,null,null,null,"> 45 dB(A)","< 45 dB(A)","< 40 dB(A)","< 35 dB(A)","< 30 dB(A)","< 25 dB(A)","< 20 dB(A)"]
["Körperschallentkopplung Kleinhammerwerk [L'K,w]",null,null,null,null,null,null,"> 63 dB","< 63 dB","< 58 dB","< 53 dB","< 48 dB","< 43 dB","< 38 dB"]

{"sheet":"Baulicher Schallschutz (GR)","index":14,"n_rows":19,"n_cols":14,"rows_kept":19,"cut":false,"hidden":true,"merged":[[8,0,9,1],[8,3,8,4],[9,3,9,4],[0,0,0,1],[0,3,0,4],[1,0,1,1],[2,0,6,1],[2,3,2,4],[7,0,7,13],[2,6,6,6],[3,3,3,4],[4,3,4,4],[5,3,5,4],[6,3,6,4],[10,0,10,13],[11,0,18,1],[11,2,12,2],[11,3,12,4],[11,5,12,5],[11,6,18,6],[11,7,12,7],[11,8,12,8],[11,9,12,9],[11,10,12,10],[15,11,16,11],[15,12,16,12],[11,11,12,11],[11,12,12,12],[11,13,12,13],[13,2,14,2],[13,5,14,5],[13,9,14,9],[13,10,14,10],[13,11,14,11],[15,2,16,2],[15,5,16,5],[15,7,16,7],[15,8,16,8],[15,9,16,9],[15,10,16,10],[15,13,16,13],[17,2,18,2],[17,5,18,5],[17,7,18,7],[17,8,18,8],[17,9,18,9],[17,10,18,10],[17,11,18,11],[17,12,18,12],[17,13,18,13]]}
["Bereich",null,"NR","Kriterium",null,"Punkte",null,"F","E","D","C","B","A","A*"]
[]
["fremde Nutzer direkt angrenzend \n(mit gemeinsamer Trennfläche)",null,93,"0 - 1 Nachbarwohneinheit",null,20]
[null,null,94,"2 Nachbarwohneinheiten",null,15]
[null,null,95,"3 Nachbarwohneinheiten",null,10]
[null,null,96,"4 Nachbarwohneinheiten",null,5]
[null,null,97,"5 Nachbarwohneinheiten",null,0]
[]
["Anordnung der lauten Räume\nschalltechnisch \n(z.B. Bäder, Treppenhaus, Aufzug)",null,98,"günstig",null,5]
[null,null,99,"ungünstig",null,0]
[]
["besonders laute Räume gem. \nDIN 4109-1:2018-01 angrenzend\n(Gaststätten, Betriebe)\nLr,n in dB (A)",null,100,"keine besonders lauten Räume",null,15]
[]
[null,null,101,"Lr,n     t / n","25 / 15 dB (A)",10]
[null,null,null,"Lmax,n      t / n","35 / 25 dB (A)"]
[null,null,102,"Lr,n     t / n","30 / 20 dB (A)",5]
[null,null,null,"Lmax,n      t / n","40 / 30 dB (A)"]
[null,null,103,"Lr,n     t / n","35 / 25 dB (A)",0]
[null,null,null,"Lmax,n      t / n","45 / 35 dB (A)"]

{"sheet":"eigener Wohnbereich","index":15,"n_rows":6,"n_cols":14,"rows_kept":6,"cut":false,"hidden":true,"merged":[[2,6,5,6],[4,3,4,4],[5,3,5,4],[0,0,0,1],[0,3,0,4],[1,0,1,1],[2,0,5,1],[2,3,2,4],[3,3,3,4]]}
["Bereich",null,"NR","Kriterium",null,"Punkte",null,"F","E","D","C","B","A","A*"]
[]
[null,null,106,"Klasse EW3 erfüllt",null,15,null,null,null,null,null,null,null,"E"]
[null,null,107,"Klasse EW2 erfüllt",null,10,null,null,null,null,null,null,null,"E"]
[null,null,108,"Klasse EW1 erfüllt",null,5,null,null,null,null,null,null,"E"]
[null,null,109,"Keine Empfehlung vereinbart",null,0,null,null,null,null,null,null,"E"]

{"sheet":"Gebietscharakter","index":16,"n_rows":7,"n_cols":14,"rows_kept":7,"cut":false,"hidden":true,"merged":[[0,0,0,1],[0,3,0,4],[2,0,6,1],[2,6,6,6],[2,3,2,4],[3,3,3,4],[4,3,4,4],[5,3,5,4],[6,3,6,4]]}
["Bereich",null,"NR","Kriterium",null,"Punkte",null,"F","E","D","C","B","A","A*"]
[]
["Gebietscharakter \nnach TA - Lärm \nDIN 18005 \noder vergleichbaren \nkommunalen Einstufungen",null,1,"WR",null,30]
[null,null,2,"WA",null,20]
[null,null,3,"MI / WB",null,10]
[null,null,4,"GE",null,5]
[null,null,5,"GI",null,0]

{"sheet":"Außenlärmpegel","index":17,"n_rows":14,"n_cols":14,"rows_kept":14,"cut":false,"hidden":true,"merged":[[2,10,3,10],[2,11,3,11],[4,8,5,8],[4,9,5,9],[8,8,9,8],[8,9,9,9],[2,8,3,8],[2,9,3,9],[6,8,7,8],[6,9,7,9],[2,0,13,1],[2,3,3,3],[2,6,13,6],[2,7,3,7],[6,3,7,3],[6,7,7,7],[10,3,11,3],[10,7,11,7],[4,3,5,3],[4,7,5,7],[8,3,9,3],[8,7,9,7],[4,12,5,12],[4,13,5,13],[6,10,7,10],[6,11,7,11],[8,10,9,10],[8,11,9,11],[12,12,13,12],[12,13,13,13],[12,3,13,3],[12,7,13,7],[12,8,13,8],[12,9,13,9],[12,10,13,10],[12,11,13,11],[0,0,0,1],[0,3,0,4],[10,12,11,12],[10,13,11,13],[10,8,11,8],[10,9,11,9],[10,10,11,10],[10,11,11,11],[6,12,7,12],[6,13,7,13],[8,12,9,12],[8,13,9,13],[2,12,3,12],[2,13,3,13],[4,10,5,10],[4,11,5,11]]}
["Bereich",null,"NR","Kriterium",null,"Punkte",null,"F","E","D","C","B","A","A*"]
[]
["maßgeblicher Außenlärmpegel in dB(A) nach DIN 4109-1:2018-01 bzw. Lärmpegelbereich \n(Bahn, Straße, Gewerbe, Freizeit)",null,6,"I\nbis 55","Freibereich \nabgewandt",27]
[null,null,7,null,"Orientierung\nbeliebig",25]
[null,null,8,"II\n56 bis 60","Freibereich\nabgewandt",22]
[null,null,9,null,"Orientierung\nbeliebig",20]
[null,null,10,"III\n61 bis 65","Freibereich\nabgewandt",17]
[null,null,11,null,"Orientierung\nbeliebig",15]
[null,null,12,"IV\n66 bis 70","Freibereich\nabgewandt",12]
[null,null,13,null,"Orientierung\nbeliebig",10]
[null,null,14,"V\n71 bis 75","Freibereich\nabgewandt",7]
[null,null,15,null,"Orientierung\nbeliebig",5]
[null,null,16,"VI\n> 76","Freibereich\nabgewandt",2]
[null,null,17,null,"Orientierung\nbeliebig",0]

{"sheet":"LS Wände","index":18,"n_rows":15,"n_cols":14,"rows_kept":15,"cut":false,"hidden":true,"merged":[[14,0,14,5],[11,3,11,4],[9,3,9,4],[0,0,0,1],[0,3,0,4],[2,0,11,1],[2,3,2,4],[10,3,10,4],[9,6,10,6],[2,6,7,6],[3,3,3,4],[4,3,4,4],[5,3,5,4],[6,3,6,4],[7,3,7,4]]}
["Bereich",null,"NR","Kriterium",null,"Punkte",null,"F","E","D","C","B","A","A*"]
[]
["Wände\nR'w in dB",null,18,"³ 72",null,50]
[null,null,19,"³ 67",null,40]
[null,null,20,"³ 62",null,30]
[null,null,21,"³ 56",null,20]
[null,null,22,"³ 53",null,10]
[null,null,23,"³ 50",null,5]
[null,null,null,"Nachweis"]
[null,null,24,"rechnerischer Nachweis nach\nDIN 4109-1:2018-01",null,0]
[null,null,25,"mess-\ntechnischer Nachweis",null,8]
[null,null,26,"Anforderung bei R'w + Ctr,50-3150 erfüllt",null,4]
[]
["Anforderungen Luftschall"]
["Wände R'w in dB",null,null,null,null,null,null,"< 50 dB","> 50 dB","> 53 dB","> 56 dB","> 62 dB","> 67 dB","> 72 dB"]

{"sheet":"Baulicher Schallschutz (NHZ)","index":19,"n_rows":4,"n_cols":14,"rows_kept":4,"cut":false,"hidden":true,"merged":[[2,6,3,6],[3,3,3,4],[0,0,0,1],[0,3,0,4],[1,0,1,1],[2,0,3,1],[2,3,2,4]]}
["Bereich",null,"NR","Kriterium",null,"Punkte",null,"F","E","D","C","B","A","A*"]
[]
["Treppenhaus",null,104,"A/V > 0,20\nKein gemeinsames Treppenhaus",null,8,null,null,null,null,null,null,null,"E"]
[null,null,105,"A/V > 0,10",null,5,null,null,null,null,null,"E"]